Reaction Details
TargetDipeptidyl peptidase 4
LigandBDBM50146972
Substrate/Competitorn/a
Meas. Tech.ChEMBL_397956 (CHEMBL856332)
Ki 0.082±n/a nM
Citation Soroka, AVan der Veken, PDe Meester, ILambeir, AMMaes, MBScharpé, SHaemers, AAugustyns, K Synthesis and dipeptidyl peptidase inhibition of N-(4-substituted-2,4-diaminobutanoyl)piperidines. Bioorg Med Chem Lett16:4777-9 (2006) 
 
Dipeptidyl peptidase 4
Name:Dipeptidyl peptidase 4
Type:Enzyme
Mol. Mass.:88271.01
Organism:Homo sapiens (Human)
Description:P27487
Residue:766
BDBM50146972
NameBDBM50146972
Synonyms:(S)-4-(4-chlorobenzylamino)-2-amino-1-(piperidin-1-yl)butan-1-one CHEMBL98869 | N4-(4-chlorobenzyl)-2,4-diaminobutanoylpiperidine
TypeSmall organic molecule
Emp. Form.C16H24ClN3O
Mol. Mass.309.834
SMILESN[C@@H](CCNCc1ccc(Cl)cc1)C(=O)N1CCCCC1