Reaction Details
TargetDipeptidyl peptidase 2
LigandBDBM50191164
Substrate/Competitorn/a
Meas. Tech.ChEMBL_397957 (CHEMBL856334)
IC50 3.8±n/a nM
Citation Soroka, AVan der Veken, PDe Meester, ILambeir, AMMaes, MBScharpé, SHaemers, AAugustyns, K Synthesis and dipeptidyl peptidase inhibition of N-(4-substituted-2,4-diaminobutanoyl)piperidines. Bioorg Med Chem Lett16:4777-9 (2006) 
 
Dipeptidyl peptidase 2
Name:Dipeptidyl peptidase 2
Type:Protein
Mol. Mass.:54339.29
Organism:Homo sapiens (Human)
Description:Q9UHL4
Residue:492
BDBM50191164
NameBDBM50191164
Synonyms:(2S,4S)-4-(4-chlorobenzylamino)-2-amino-5-phenyl-1-(piperidin-1-yl)pentan-1-one | CHEMBL214630
TypeSmall organic molecule
Emp. Form.C23H30ClN3O
Mol. Mass.399.957
SMILESN[C@@H](C[C@H](Cc1ccccc1)NCc1ccc(Cl)cc1)C(=O)N1CCCCC1