Reaction Details
TargetBeta-lactamase
LigandBDBM50191379
Substrate/Competitorn/a
Meas. Tech.ChEMBL_365445 (CHEMBL869112)
IC50 1±n/a nM
Citation Venkatesan, AMAgarwal, AAbe, TUshirogochi, HYamamura, IAdo, MTsuyoshi, TDos Santos, OGu, YSum, FWLi, ZFrancisco, GLin, YIPetersen, PJYang, YKumagai, TWeiss, WJShlaes, DMKnox, JRMansour, TS Structure-activity relationship of 6-methylidene penems bearing 6,5 bicyclic heterocycles as broad-spectrum beta-lactamase inhibitors: evidence for 1,4-thiazepine intermediates with C7 R stereochemistry by computational methods. J Med Chem49:4623-37 (2006) 
 
Beta-lactamase
Name:Beta-lactamase
Type:PROTEIN
Mol. Mass.:41306.67
Organism:Enterobacter cloacae
Description:ChEMBL_40258
Residue:381
BDBM50191379
NameBDBM50191379
Synonyms:(5R)(6Z)-6-(6,7-dihydro-4H-pyrazolo[5,1-c][1,4]-thiazin-2-ylmethylene)-7-oxo-4-thia-1-azabicyclo[3.2.0]hept-2-ene-2-carboxylic acid sodium salt | CHEMBL212760
TypeSmall organic molecule
Emp. Form.C13H10N3O3S2
Mol. Mass.320.367
SMILES[O-]C(=O)C1=CS[C@H]2N1C(=O)\C2=C\c1cc2CSCCn2n1