Reaction Details
TargetBeta-lactamase TEM
LigandBDBM50191385
Substrate/Competitorn/a
Meas. Tech.ChEMBL_365442 (CHEMBL869109)
IC50 4±n/a nM
Citation Venkatesan, AMAgarwal, AAbe, TUshirogochi, HYamamura, IAdo, MTsuyoshi, TDos Santos, OGu, YSum, FWLi, ZFrancisco, GLin, YIPetersen, PJYang, YKumagai, TWeiss, WJShlaes, DMKnox, JRMansour, TS Structure-activity relationship of 6-methylidene penems bearing 6,5 bicyclic heterocycles as broad-spectrum beta-lactamase inhibitors: evidence for 1,4-thiazepine intermediates with C7 R stereochemistry by computational methods. J Med Chem49:4623-37 (2006) 
 
Beta-lactamase TEM
Name:Beta-lactamase TEM
Type:Enzyme
Mol. Mass.:31512.33
Organism:Escherichia coli
Description:P62593
Residue:286
BDBM50191385
NameBDBM50191385
Synonyms:(5R,6Z)-6-(6,7-dihydro-4H-pyrazolo[5,1-c]-[1,4]oxazin-2-ylmethylene)-7-oxo-4-thia-1-azabicyclo[3.2.0]hept-2-ene-2-carboxylic acid sodium salt | CHEMBL377382
TypeSmall organic molecule
Emp. Form.C13H10N3O4S
Mol. Mass.304.302
SMILES[O-]C(=O)C1=CS[C@H]2N1C(=O)\C2=C\c1cc2COCCn2n1