Reaction Details
TargetRNA-directed RNA polymerase
LigandBDBM50191532
Substrate/Competitorn/a
Meas. Tech.ChEMBL_376990 (CHEMBL866684)
IC50 16±n/a nM
Citation Hirashima, SSuzuki, TIshida, TNoji, SYata, SAndo, IKomatsu, MIkeda, SHashimoto, H Benzimidazole derivatives bearing substituted biphenyls as hepatitis C virus NS5B RNA-dependent RNA polymerase inhibitors: structure-activity relationship studies and identification of a potent and highly selective inhibitor JTK-109. J Med Chem49:4721-36 (2006) 
 
RNA-directed RNA polymerase
Name:RNA-directed RNA polymerase
Type:Protein
Mol. Mass.:25173.95
Organism:Hepatitis C virus
Description:Q8JXU8
Residue:229
BDBM50191532
NameBDBM50191532
Synonyms:2-[4-(4'-chloro-4-sulfamoylbiphenyl-2-ylmethoxy)phenyl]-1-cyclohexyl-1H-benzimidazole-5-carboxylic acid | CHEMBL378470
TypeSmall organic molecule
Emp. Form.C33H30ClN3O5S
Mol. Mass.616.126
SMILESNS(=O)(=O)c1ccc(c(COc2ccc(cc2)-c2nc3cc(ccc3n2C2CCCCC2)C(O)=O)c1)-c1ccc(Cl)cc1