Reaction Details
TargetRNA-directed RNA polymerase
LigandBDBM50191550
Substrate/Competitorn/a
Meas. Tech.ChEMBL_376990 (CHEMBL866684)
IC50 100±n/a nM
Citation Hirashima, SSuzuki, TIshida, TNoji, SYata, SAndo, IKomatsu, MIkeda, SHashimoto, H Benzimidazole derivatives bearing substituted biphenyls as hepatitis C virus NS5B RNA-dependent RNA polymerase inhibitors: structure-activity relationship studies and identification of a potent and highly selective inhibitor JTK-109. J Med Chem49:4721-36 (2006) 
 
RNA-directed RNA polymerase
Name:RNA-directed RNA polymerase
Type:Protein
Mol. Mass.:25173.95
Organism:Hepatitis C virus
Description:Q8JXU8
Residue:229
BDBM50191550
NameBDBM50191550
Synonyms:2-[4-(biphenyl-2-ylmethoxy)-2-fluorophenyl]-1-cyclohexyl-1H-benzoimidazole-5-carboxylic acid | CHEMBL387301
TypeSmall organic molecule
Emp. Form.C33H29FN2O3
Mol. Mass.520.5934
SMILESOC(=O)c1ccc2n(C3CCCCC3)c(nc2c1)-c1ccc(OCc2ccccc2-c2ccccc2)cc1F