Reaction Details
TargetAromatase
LigandBDBM8611
Substrate/Competitorn/a
Meas. Tech.ChEMBL_376274 (CHEMBL870913)
IC50 52±n/a nM
Citation Gobbi, SCavalli, ARampa, ABelluti, FPiazzi, LPaluszcak, AHartmann, RWRecanatini, MBisi, A Lead optimization providing a series of flavone derivatives as potent nonsteroidal inhibitors of the cytochrome P450 aromatase enzyme. J Med Chem49:4777-80 (2006) 
 
Aromatase
Name:Aromatase
Type:Enzyme
Mol. Mass.:57888.92
Organism:Homo sapiens (Human)
Description:P11511
Residue:503
BDBM8611
NameBDBM8611
Synonyms:4-{5H,6H,7H,8H-imidazo[1,5-a]pyridin-5-yl}benzonitrile CHEMBL9298 US9271963, Fadrozole
TypeSmall organic molecule
Emp. Form.C14H13N3
Mol. Mass.223.2731
SMILESN#Cc1ccc(cc1)C1CCCc2cncn12