Reaction Details
TargetSteroid 17-alpha-hydroxylase/17,20 lyase
LigandBDBM7887
Substrate/Competitorn/a
Meas. Tech.ChEMBL_398341 (CHEMBL908006)
IC50 50900±n/a nM
Citation Patel, CHDhanani, SOwen, CPAhmed, S Synthesis, biochemical evaluation and rationalisation of the inhibitory activity of a range of 4-substituted phenyl alkyl imidazole-based inhibitors of the enzyme complex 17alpha-hydroxylase/17,20-lyase (P450(17alpha)). Bioorg Med Chem Lett16:4752-6 (2006) 
 
Steroid 17-alpha-hydroxylase/17,20 lyase
Name:Steroid 17-alpha-hydroxylase/17,20 lyase
Type:Enzyme
Mol. Mass.:57255.68
Organism:Rattus norvegicus (Rat)
Description:P11715
Residue:507
BDBM7887
NameBDBM7887
Synonyms:1-Benzylimidazole (BI) 1-benzylimidazole US9138393, 1-benzylimidazole
TypeSmall organic molecule
Emp. Form.C10H10N2
Mol. Mass.158.1998
SMILESC(c1ccccc1)n1ccnc1