Reaction Details
TargetCyclin-dependent kinase 1/G2/mitotic-specific cyclin-B1/G2/mitotic-specific cyclin-B2/G2/mitotic-specific cyclin-B3
LigandBDBM50191913
Substrate/Competitorn/a
Meas. Tech.ChEMBL_398263 (CHEMBL908007)
IC50 0.6±n/a nM
Citation Huang, SLi, RConnolly, PJEmanuel, SMiddleton, SA Synthesis of 2-amino-4-(7-azaindol-3-yl)pyrimidines as cyclin dependent kinase 1 (CDK1) inhibitors. Bioorg Med Chem Lett16:4818-21 (2006) 
 
Cyclin-dependent kinase 1/G2/mitotic-specific cyclin-B1/G2/mitotic-specific cyclin-B2/G2/mitotic-specific cyclin-B3
Name:Cyclin-dependent kinase 1/G2/mitotic-specific cyclin-B1/G2/mitotic-specific cyclin-B2/G2/mitotic-specific cyclin-B3
Type:n/a
Mol. Mass.:n/a
Description:ASSAY_ID of EBI is 40085
Components:This complex has 4 components.
Component 1
Name:G2/mitotic-specific cyclin-B3
Synonyms:CCNB3 CYCB3 G2/mitotic-specific cyclin-B3
Type:PROTEIN
Mol. Mass.:157916.84
Organism:Homo sapiens (Human)
Description:n/a
Residue:1395
Component 2
Name:G2/mitotic-specific cyclin-B1
Synonyms:CCNB CCNB1_HUMAN
Type:Enzyme Subunit
Mol. Mass.:48340.95
Organism:Homo sapiens (Human)
Description:P14635
Residue:433
Component 3
Name:G2/mitotic-specific cyclin-B2
Synonyms:CCNB2 Cyclin-dependent kinase 1/cyclin B | G2/mitotic-specific cyclin-B2
Type:PROTEIN
Mol. Mass.:45293.13
Organism:Homo sapiens (Human)
Description:n/a
Residue:398
Component 4
Name:Cyclin-dependent kinase 1
Synonyms:CDC2 CDK1 CDKN1 Cell division protein kinase 1 P34CDC2 | p34 protein kinase
Type:Enzyme Subunit
Mol. Mass.:34101.08
Organism:Homo sapiens (Human)
Description:P06493
Residue:297
BDBM50191913
NameBDBM50191913
Synonyms:CHEMBL384350 | N-(2-methyl-4-(2-(pyrrolidin-1-yl)ethyl)phenyl)-4-(1H-pyrrolo[2,3-b]pyridin-3-yl)pyrimidin-2-amine
TypeSmall organic molecule
Emp. Form.C24H26N6
Mol. Mass.398.5034
SMILESCc1cc(CCN2CCCC2)ccc1Nc1nccc(n1)-c1c[nH]c2ncccc12