Reaction Details
TargetC5a anaphylatoxin chemotactic receptor 1
LigandBDBM50192041
Substrate/Competitorn/a
Meas. Tech.ChEMBL_394614 (CHEMBL910274)
IC50 111±n/a nM
Citation Schnatbaum, KLocardi, EScharn, DRichter, UHawlisch, HKnolle, JPolakowski, T Peptidomimetic C5a receptor antagonists with hydrophobic substitutions at the C-terminus: increased receptor specificity and in vivo activity. Bioorg Med Chem Lett16:5088-92 (2006) 
 
C5a anaphylatoxin chemotactic receptor 1
Name:C5a anaphylatoxin chemotactic receptor 1
Type:Enzyme
Mol. Mass.:39347.68
Organism:Homo sapiens (Human)
Description:P21730
Residue:350
BDBM50192041
NameBDBM50192041
Synonyms:CHEMBL2371928 | Hoo-Phe-Orn-Pro-hle-Pff-Phe-NH2
TypeSmall organic molecule
Emp. Form.C49H63FN10O9
Mol. Mass.955.0845
SMILESCC(C)CC[C@H](NC(=O)[C@@H]1CCCN1C(=O)[C@H](CCCN)NC(=O)[C@H](Cc1ccccc1)NC(=O)[C@@H]1CC(=O)NC(=O)N1)C(=O)N[C@@H](Cc1ccc(F)cc1)C(=O)N[C@H](Cc1ccccc1)C(N)=O