Reaction Details
TargetOxysterols receptor LXR-alpha
LigandBDBM50192152
Substrate/Competitorn/a
Meas. Tech.ChEMBL_406039 (CHEMBL912135)
IC50 100±n/a nM
Citation Panday, NBenz, JBlum-Kaelin, DBourgeaux, VDehmlow, HHartman, PKuhn, BRatni, HWarot, XWright, MB Synthesis and evaluation of anilinohexafluoroisopropanols as activators/modulators of LXRalpha and beta. Bioorg Med Chem Lett16:5231-7 (2006) 
 
Oxysterols receptor LXR-alpha
Name:Oxysterols receptor LXR-alpha
Type:Enzyme Catalytic Domain
Mol. Mass.:50403.85
Organism:Homo sapiens (Human)
Description:Q13133
Residue:447
BDBM50192152
NameBDBM50192152
Synonyms:2-(4-(2-((2-chloro-4-(1,1,1,3,3,3-hexafluoro-2-hydroxypropan-2-yl)phenyl)(ethyl)amino)-2-phenylethoxy)phenyl)acetic acid | CHEMBL214546
TypeSmall organic molecule
Emp. Form.C27H24ClF6NO4
Mol. Mass.575.927
SMILESCCN(C(COc1ccc(CC(O)=O)cc1)c1ccccc1)c1ccc(cc1Cl)C(O)(C(F)(F)F)C(F)(F)F