Reaction Details
TargetOxysterols receptor LXR-beta
LigandBDBM50192133
Substrate/Competitorn/a
Meas. Tech.ChEMBL_406040 (CHEMBL912144)
IC50 60±n/a nM
Citation Panday, NBenz, JBlum-Kaelin, DBourgeaux, VDehmlow, HHartman, PKuhn, BRatni, HWarot, XWright, MB Synthesis and evaluation of anilinohexafluoroisopropanols as activators/modulators of LXRalpha and beta. Bioorg Med Chem Lett16:5231-7 (2006) 
 
Oxysterols receptor LXR-beta
Name:Oxysterols receptor LXR-beta
Type:Enzyme Catalytic Domain
Mol. Mass.:50978.79
Organism:Homo sapiens (Human)
Description:P55055
Residue:460
BDBM50192133
NameBDBM50192133
Synonyms:2-(4-(benzyl(2,2,2-trifluoroethyl)amino)phenyl)-1,1,1,3,3,3-hexafluoropropan-2-ol | CHEMBL214777
TypeSmall organic molecule
Emp. Form.C18H14F9NO
Mol. Mass.431.2955
SMILESOC(c1ccc(cc1)N(Cc1ccccc1)CC(F)(F)F)(C(F)(F)F)C(F)(F)F