Reaction Details
TargetOxysterols receptor LXR-alpha
LigandBDBM50192153
Substrate/Competitorn/a
Meas. Tech.ChEMBL_406039 (CHEMBL912135)
IC50 60±n/a nM
Citation Panday, NBenz, JBlum-Kaelin, DBourgeaux, VDehmlow, HHartman, PKuhn, BRatni, HWarot, XWright, MB Synthesis and evaluation of anilinohexafluoroisopropanols as activators/modulators of LXRalpha and beta. Bioorg Med Chem Lett16:5231-7 (2006) 
 
Oxysterols receptor LXR-alpha
Name:Oxysterols receptor LXR-alpha
Type:Enzyme Catalytic Domain
Mol. Mass.:50403.85
Organism:Homo sapiens (Human)
Description:Q13133
Residue:447
BDBM50192153
NameBDBM50192153
Synonyms:CHEMBL215167 | methyl 2-((2-chloro-4-(1,1,1,3,3,3-hexafluoro-2-hydroxypropan-2-yl)phenyl)(ethyl)amino)-2-phenylbutanoate
TypeSmall organic molecule
Emp. Form.C22H22ClF6NO3
Mol. Mass.497.858
SMILESCCN(c1ccc(cc1Cl)C(O)(C(F)(F)F)C(F)(F)F)C(CC)(C(=O)OC)c1ccccc1