Reaction Details
TargetOxysterols receptor LXR-alpha
LigandBDBM50192144
Substrate/Competitorn/a
Meas. Tech.ChEMBL_406041 (CHEMBL912145)
EC50 800±n/a nM
Citation Panday, NBenz, JBlum-Kaelin, DBourgeaux, VDehmlow, HHartman, PKuhn, BRatni, HWarot, XWright, MB Synthesis and evaluation of anilinohexafluoroisopropanols as activators/modulators of LXRalpha and beta. Bioorg Med Chem Lett16:5231-7 (2006) 
 
Oxysterols receptor LXR-alpha
Name:Oxysterols receptor LXR-alpha
Type:Enzyme Catalytic Domain
Mol. Mass.:50403.85
Organism:Homo sapiens (Human)
Description:Q13133
Residue:447
BDBM50192144
NameBDBM50192144
Synonyms:2-(3-chloro-4-(ethyl(phenethyl)amino)phenyl)-1,1,1,3,3,3-hexafluoropropan-2-ol | CHEMBL386530
TypeSmall organic molecule
Emp. Form.C19H18ClF6NO
Mol. Mass.425.796
SMILESCCN(CCc1ccccc1)c1ccc(cc1Cl)C(O)(C(F)(F)F)C(F)(F)F