Reaction Details
TargetOxysterols receptor LXR-alpha
LigandBDBM50192134
Substrate/Competitorn/a
Meas. Tech.ChEMBL_406039 (CHEMBL912135)
IC50 3±n/a nM
Citation Panday, NBenz, JBlum-Kaelin, DBourgeaux, VDehmlow, HHartman, PKuhn, BRatni, HWarot, XWright, MB Synthesis and evaluation of anilinohexafluoroisopropanols as activators/modulators of LXRalpha and beta. Bioorg Med Chem Lett16:5231-7 (2006) 
 
Oxysterols receptor LXR-alpha
Name:Oxysterols receptor LXR-alpha
Type:Enzyme Catalytic Domain
Mol. Mass.:50403.85
Organism:Homo sapiens (Human)
Description:Q13133
Residue:447
BDBM50192134
NameBDBM50192134
Synonyms:2-(4-(benzyl(ethyl)amino)-3-chlorophenyl)-1,1,1,3,3,3-hexafluoropropan-2-ol | CHEMBL215663
TypeSmall organic molecule
Emp. Form.C18H16ClF6NO
Mol. Mass.411.769
SMILESCCN(Cc1ccccc1)c1ccc(cc1Cl)C(O)(C(F)(F)F)C(F)(F)F