Reaction Details
TargetAurora kinase A
LigandBDBM12410
Substrate/Competitorn/a
Meas. Tech.ChEMBL_420096 (CHEMBL912713)
IC50 85±n/a nM
Citation Lyne, PDLamb, MLSaeh, JC Accurate prediction of the relative potencies of members of a series of kinase inhibitors using molecular docking and MM-GBSA scoring. J Med Chem49:4805-8 (2006) 
 
Aurora kinase A
Name:Aurora kinase A
Type:Serine/threonine-protein kinase
Mol. Mass.:45830.98
Organism:Homo sapiens (Human)
Description:O14965
Residue:403
BDBM12410
NameBDBM12410
Synonyms:4-ethyl-N-[5-({6-methoxy-7-[3-(morpholin-4-yl)propoxy]quinazolin-4-yl}amino)pyrimidin-2-yl]benzamide quinazoline deriv. 8
TypeSmall organic molecule
Emp. Form.C29H33N7O4
Mol. Mass.543.6168
SMILESCCc1ccc(cc1)C(=O)Nc1ncc(Nc2ncnc3cc(OCCCN4CCOCC4)c(OC)cc23)cn1