Reaction Details
TargetReverse transcriptase/RNaseH
LigandBDBM50192307
Substrate/Competitorn/a
Meas. Tech.ChEMBL_378455 (CHEMBL871029)
IC50 8400±n/a nM
Citation Sluis-Cremer, NHamamouch, NSan Félix, AVelazquez, SBalzarini, JCamarasa, MJ Structure-activity relationships of [2',5'-bis-O-(tert-butyldimethylsilyl)-beta-D-ribofuranosyl]- 3'-spiro-5' '-(4' '-amino-1' ',2' '-oxathiole-2' ',2' '-dioxide)thymine derivatives as inhibitors of HIV-1 reverse transcriptase dimerization. J Med Chem49:4834-41 (2006) 
 
Reverse transcriptase/RNaseH
Name:Reverse transcriptase/RNaseH
Type:PROTEIN
Mol. Mass.:65229.15
Organism:Human immunodeficiency virus 1
Description:ChEMBL_1473730
Residue:566
BDBM50192307
NameBDBM50192307
Synonyms:3-[(5R,6R,8R,9R)-4-amino-9-(tert-butyl-dimethyl-silanyloxy)-6-(tert-butyl-dimethyl-silanyloxymethyl)-2,2-dioxo-1,7-dioxa-2lambda*6*-thia-spiro[4.4]non-3-en-8-yl]-3H-[1,2,3]triazole-4-carboxylic acid amide | CHEMBL437717
TypeSmall organic molecule
Emp. Form.C22H41N5O7SSi2
Mol. Mass.575.826
SMILESCC(C)(C)[Si](C)(C)OC[C@H]1O[C@H]([C@H](O[Si](C)(C)C(C)(C)C)[C@]11OS(=O)(=O)C=C1N)n1nncc1C(N)=O