Reaction Details
TargetReverse transcriptase/RNaseH
LigandBDBM50100110
Substrate/Competitorn/a
Meas. Tech.ChEMBL_378455 (CHEMBL871029)
IC50 700±n/a nM
Citation Sluis-Cremer, NHamamouch, NSan Félix, AVelazquez, SBalzarini, JCamarasa, MJ Structure-activity relationships of [2',5'-bis-O-(tert-butyldimethylsilyl)-beta-D-ribofuranosyl]- 3'-spiro-5' '-(4' '-amino-1' ',2' '-oxathiole-2' ',2' '-dioxide)thymine derivatives as inhibitors of HIV-1 reverse transcriptase dimerization. J Med Chem49:4834-41 (2006) 
 
Reverse transcriptase/RNaseH
Name:Reverse transcriptase/RNaseH
Type:PROTEIN
Mol. Mass.:65229.15
Organism:Human immunodeficiency virus 1
Description:ChEMBL_1473730
Residue:566
BDBM50100110
NameBDBM50100110
Synonyms:1-[4-Amino-9-(tert-butyl-dimethyl-silanyloxy)-6-(tert-butyl-dimethyl-silanyloxymethyl)-2,2-dioxo-1,7-dioxa-2lambda*6*-thia-spiro[4.4]non-3-en-8-yl]-3-(3-hydroxy-propyl)-5-methyl-1H-pyrimidine-2,4-dione BDBM50192298 | CHEMBL387370
TypeSmall organic molecule
Emp. Form.C27H49N3O9SSi2
Mol. Mass.647.929
SMILESCc1cn([C@@H]2O[C@H](CO[Si](C)(C)C(C)(C)C)[C@@]3(OS(=O)(=O)C=C3N)[C@H]2O[Si](C)(C)C(C)(C)C)c(=O)n(CCCO)c1=O