Reaction Details
TargetReverse transcriptase/RNaseH
LigandBDBM50192294
Substrate/Competitorn/a
Meas. Tech.ChEMBL_378455 (CHEMBL871029)
IC50 4800±n/a nM
Citation Sluis-Cremer, NHamamouch, NSan Félix, AVelazquez, SBalzarini, JCamarasa, MJ Structure-activity relationships of [2',5'-bis-O-(tert-butyldimethylsilyl)-beta-D-ribofuranosyl]- 3'-spiro-5' '-(4' '-amino-1' ',2' '-oxathiole-2' ',2' '-dioxide)thymine derivatives as inhibitors of HIV-1 reverse transcriptase dimerization. J Med Chem49:4834-41 (2006) 
 
Reverse transcriptase/RNaseH
Name:Reverse transcriptase/RNaseH
Type:PROTEIN
Mol. Mass.:65229.15
Organism:Human immunodeficiency virus 1
Description:ChEMBL_1473730
Residue:566
BDBM50192294
NameBDBM50192294
Synonyms:1-[(5R,6R,8R,9R)-4-amino-9-(tert-butyl-dimethyl-silanyloxy)-6-(tert-butyl-dimethyl-silanyloxymethyl)-3-(3-hydroxy-propenyl)-2,2-dioxo-1,7-dioxa-2lambda*6*-thia-spiro[4.4]non-3-en-8-yl]-5-methyl-1H-pyrimidine-2,4-dione | CHEMBL379255
TypeSmall organic molecule
Emp. Form.C27H47N3O9SSi2
Mol. Mass.645.913
SMILESCc1cn([C@@H]2O[C@H](CO[Si](C)(C)C(C)(C)C)[C@@]3(OS(=O)(=O)C(=CCCO)C3=N)[C@H]2O[Si](C)(C)C(C)(C)C)c(=O)[nH]c1=O