Reaction Details
TargetReverse transcriptase/RNaseH
LigandBDBM50175609
Substrate/Competitorn/a
Meas. Tech.ChEMBL_378454 (CHEMBL871028)
IC50 6800±n/a nM
Citation Sluis-Cremer, NHamamouch, NSan Félix, AVelazquez, SBalzarini, JCamarasa, MJ Structure-activity relationships of [2',5'-bis-O-(tert-butyldimethylsilyl)-beta-D-ribofuranosyl]- 3'-spiro-5' '-(4' '-amino-1' ',2' '-oxathiole-2' ',2' '-dioxide)thymine derivatives as inhibitors of HIV-1 reverse transcriptase dimerization. J Med Chem49:4834-41 (2006) 
 
Reverse transcriptase/RNaseH
Name:Reverse transcriptase/RNaseH
Type:PROTEIN
Mol. Mass.:65229.15
Organism:Human immunodeficiency virus 1
Description:ChEMBL_1473730
Residue:566
BDBM50175609
NameBDBM50175609
Synonyms:5-{3-[4-Amino-9-(tert-butyl-dimethyl-silanyloxy)-6-(tert-butyl-dimethyl-silanyloxymethyl)-2,2-dioxo-1,7-dioxa-2lambda*6*-thia-spiro[4.4]non-3-en-8-yl]-5-methyl-2,6-dioxo-3,6-dihydro-2H-pyrimidin-1-yl}-pentanoic acid methylamide CHEMBL264587
TypeSmall organic molecule
Emp. Form.C30H54N4O9SSi2
Mol. Mass.703.007
SMILESCNC(=O)CCCCn1c(=O)c(C)cn([C@@H]2O[C@H](CO[Si](C)(C)C(C)(C)C)[C@@]3(OS(=O)(=O)C=C3N)[C@H]2O[Si](C)(C)C(C)(C)C)c1=O