Reaction Details
TargetReverse transcriptase/RNaseH
LigandBDBM50192290
Substrate/Competitorn/a
Meas. Tech.ChEMBL_378455 (CHEMBL871029)
IC50 5400±n/a nM
Citation Sluis-Cremer, NHamamouch, NSan Félix, AVelazquez, SBalzarini, JCamarasa, MJ Structure-activity relationships of [2',5'-bis-O-(tert-butyldimethylsilyl)-beta-D-ribofuranosyl]- 3'-spiro-5' '-(4' '-amino-1' ',2' '-oxathiole-2' ',2' '-dioxide)thymine derivatives as inhibitors of HIV-1 reverse transcriptase dimerization. J Med Chem49:4834-41 (2006) 
 
Reverse transcriptase/RNaseH
Name:Reverse transcriptase/RNaseH
Type:PROTEIN
Mol. Mass.:65229.15
Organism:Human immunodeficiency virus 1
Description:ChEMBL_1473730
Residue:566
BDBM50192290
NameBDBM50192290
Synonyms:CHEMBL379337 | N-[(5R,6R,8R,9R)-6-benzyloxymethyl-9-(tert-butyl-dimethyl-silanyloxy)-8-(3,5-dimethyl-2,4-dioxo-3,4-dihydro-2H-pyrimidin-1-yl)-2,2-dioxo-1,7-dioxa-2lambda*6*-thia-spiro[4.4]non-3-en-4-yl]-oxalamic acid methyl ester
TypeSmall organic molecule
Emp. Form.C29H39N3O11SSi
Mol. Mass.665.784
SMILESCOC(=O)C(=O)NC1=CS(=O)(=O)O[C@@]11[C@@H](COCc2ccccc2)O[C@H]([C@@H]1O[Si](C)(C)C(C)(C)C)n1cc(C)c(=O)n(C)c1=O