Reaction Details
TargetSerine/threonine-protein kinase Chk1
LigandBDBM50192415
Substrate/Competitorn/a
Meas. Tech.ChEMBL_379936 (CHEMBL864856)
IC50 26±n/a nM
Citation Palmer, BDThompson, AMBooth, RJDobrusin, EMKraker, AJLee, HHLunney, EAMitchell, LHOrtwine, DFSmaill, JBSwan, LMDenny, WA 4-Phenylpyrrolo[3,4-c]carbazole-1,3(2H,6H)-dione inhibitors of the checkpoint kinase Wee1. Structure-activity relationships for chromophore modification and phenyl ring substitution. J Med Chem49:4896-911 (2006) 
 
Serine/threonine-protein kinase Chk1
Name:Serine/threonine-protein kinase Chk1
Type:Enzyme Catalytic Domain
Mol. Mass.:54443.02
Organism:Homo sapiens (Human)
Description:gi_166295192
Residue:476
BDBM50192415
NameBDBM50192415
Synonyms:9-hydroxy-4-(1H-pyrrol-3-yl)pyrrolo[3,4-c]carbazole-1,3(2H,6H)-dione | CHEMBL213422
TypeSmall organic molecule
Emp. Form.C18H11N3O3
Mol. Mass.317.2982
SMILESOc1ccc2[nH]c3cc(-c4cc[nH]c4)c4C(=O)NC(=O)c4c3c2c1