Reaction Details
TargetWee1-like protein kinase
LigandBDBM50192367
Substrate/Competitorn/a
Meas. Tech.ChEMBL_379935 (CHEMBL864855)
IC50 50±n/a nM
Citation Palmer, BDThompson, AMBooth, RJDobrusin, EMKraker, AJLee, HHLunney, EAMitchell, LHOrtwine, DFSmaill, JBSwan, LMDenny, WA 4-Phenylpyrrolo[3,4-c]carbazole-1,3(2H,6H)-dione inhibitors of the checkpoint kinase Wee1. Structure-activity relationships for chromophore modification and phenyl ring substitution. J Med Chem49:4896-911 (2006) 
 
Wee1-like protein kinase
Name:Wee1-like protein kinase
Type:PROTEIN
Mol. Mass.:71599.12
Organism:Homo sapiens (Human)
Description:ChEMBL_1445054
Residue:646
BDBM50192367
NameBDBM50192367
Synonyms:4-(2-chlorophenyl)-6-ethyl-9-hydroxypyrrolo[3,4-c]carbazole-1,3(2H,6H)-dione | CHEMBL379825
TypeSmall organic molecule
Emp. Form.C22H15ClN2O3
Mol. Mass.390.819
SMILESCCn1c2ccc(O)cc2c2c3C(=O)NC(=O)c3c(cc12)-c1ccccc1Cl