Reaction Details
TargetWee1-like protein kinase
LigandBDBM50192402
Substrate/Competitorn/a
Meas. Tech.ChEMBL_379935 (CHEMBL864855)
IC50 19±n/a nM
Citation Palmer, BDThompson, AMBooth, RJDobrusin, EMKraker, AJLee, HHLunney, EAMitchell, LHOrtwine, DFSmaill, JBSwan, LMDenny, WA 4-Phenylpyrrolo[3,4-c]carbazole-1,3(2H,6H)-dione inhibitors of the checkpoint kinase Wee1. Structure-activity relationships for chromophore modification and phenyl ring substitution. J Med Chem49:4896-911 (2006) 
 
Wee1-like protein kinase
Name:Wee1-like protein kinase
Type:PROTEIN
Mol. Mass.:71599.12
Organism:Homo sapiens (Human)
Description:ChEMBL_1445054
Residue:646
BDBM50192402
NameBDBM50192402
Synonyms:4-(4-amino-2-methoxyphenyl)-9-hydroxypyrrolo[3,4-c]carbazole-1,3(2H,6H)-dione | CHEMBL384089
TypeSmall organic molecule
Emp. Form.C21H15N3O4
Mol. Mass.373.3615
SMILESCOc1cc(N)ccc1-c1cc2[nH]c3ccc(O)cc3c2c2C(=O)NC(=O)c12