Reaction Details
TargetWee1-like protein kinase
LigandBDBM50192428
Substrate/Competitorn/a
Meas. Tech.ChEMBL_379935 (CHEMBL864855)
IC50 42±n/a nM
Citation Palmer, BDThompson, AMBooth, RJDobrusin, EMKraker, AJLee, HHLunney, EAMitchell, LHOrtwine, DFSmaill, JBSwan, LMDenny, WA 4-Phenylpyrrolo[3,4-c]carbazole-1,3(2H,6H)-dione inhibitors of the checkpoint kinase Wee1. Structure-activity relationships for chromophore modification and phenyl ring substitution. J Med Chem49:4896-911 (2006) 
 
Wee1-like protein kinase
Name:Wee1-like protein kinase
Type:PROTEIN
Mol. Mass.:71599.12
Organism:Homo sapiens (Human)
Description:ChEMBL_1445054
Residue:646
BDBM50192428
NameBDBM50192428
Synonyms:9-hydroxy-4-(3-thienyl)pyrrolo[3,4-c]carbazole-1,3(2H,6H)-dione CHEMBL377839
TypeSmall organic molecule
Emp. Form.C18H10N2O3S
Mol. Mass.334.349
SMILESOc1ccc2[nH]c3cc(-c4ccsc4)c4C(=O)NC(=O)c4c3c2c1