Reaction Details
TargetWee1-like protein kinase
LigandBDBM50192384
Substrate/Competitorn/a
Meas. Tech.ChEMBL_379935 (CHEMBL864855)
IC50 89±n/a nM
Citation Palmer, BDThompson, AMBooth, RJDobrusin, EMKraker, AJLee, HHLunney, EAMitchell, LHOrtwine, DFSmaill, JBSwan, LMDenny, WA 4-Phenylpyrrolo[3,4-c]carbazole-1,3(2H,6H)-dione inhibitors of the checkpoint kinase Wee1. Structure-activity relationships for chromophore modification and phenyl ring substitution. J Med Chem49:4896-911 (2006) 
 
Wee1-like protein kinase
Name:Wee1-like protein kinase
Type:PROTEIN
Mol. Mass.:71599.12
Organism:Homo sapiens (Human)
Description:ChEMBL_1445054
Residue:646
BDBM50192384
NameBDBM50192384
Synonyms:9-hydroxy-4-(3-hydroxyphenyl)pyrrolo[3,4-c]carbazole-1,3(2H,6H)-dione | CHEMBL214140
TypeSmall organic molecule
Emp. Form.C20H12N2O4
Mol. Mass.344.3203
SMILESOc1cccc(c1)-c1cc2[nH]c3ccc(O)cc3c2c2C(=O)NC(=O)c12