Reaction Details
TargetCalcitonin gene-related peptide type 1 receptor
LigandBDBM50192553
Substrate/Competitorn/a
Meas. Tech.ChEMBL_402776 (CHEMBL908628)
IC50 5.1±n/a nM
Citation Burgey, CSStump, CANguyen, DNDeng, JZQuigley, AGNorton, BRBell, IMMosser, SDSalvatore, CARutledge, RZKane, SAKoblan, KSVacca, JPGraham, SLWilliams, TM Benzodiazepine calcitonin gene-related peptide (CGRP) receptor antagonists: optimization of the 4-substituted piperidine. Bioorg Med Chem Lett16:5052-6 (2006) 
 
Calcitonin gene-related peptide type 1 receptor
Name:Calcitonin gene-related peptide type 1 receptor
Type:Enzyme Catalytic Domain
Mol. Mass.:52980.45
Organism:Homo sapiens (Human)
Description:Q16602
Residue:461
BDBM50192553
NameBDBM50192553
Synonyms:(R)-4-(4-(3-methoxyphenyl)-2-oxo-2,3-dihydroimidazol-1-yl)-N-(2-oxo-5-phenyl-1-(2,2,2-trifluoroethyl)-2,3-dihydro-1H-benzo[e][1,4]diazepin-3-yl)piperidine-1-carboxamide | CHEMBL385454
TypeSmall organic molecule
Emp. Form.C33H31F3N6O4
Mol. Mass.632.6322
SMILESCOc1cccc(c1)-c1cn(C2CCN(CC2)C(=O)N[C@@H]2N=C(c3ccccc3)c3ccccc3N(CC(F)(F)F)C2=O)c(=O)[nH]1