Reaction Details
TargetCannabinoid receptor 1
LigandBDBM50192595
Substrate/Competitorn/a
Meas. Tech.ChEMBL_422302 (CHEMBL907003)
Ki 5.6±n/a nM
Citation Huffman, JWPadgett, LWIsherwood, MLWiley, JLMartin, BR 1-Alkyl-2-aryl-4-(1-naphthoyl)pyrroles: new high affinity ligands for the cannabinoid CB1 and CB2 receptors. Bioorg Med Chem Lett16:5432-5 (2006) 
 
Cannabinoid receptor 1
Name:Cannabinoid receptor 1
Type:G Protein-Coupled Receptor (GPCR)
Mol. Mass.:52856.55
Organism:Rattus norvegicus (rat)
Description:P20272
Residue:473
BDBM50192595
NameBDBM50192595
Synonyms:CHEMBL220180 naphthalen-1-yl(1-pentyl-5-o-tolyl-1H-pyrrol-3-yl)methanone
TypeSmall organic molecule
Emp. Form.C27H27NO
Mol. Mass.381.5094
SMILESCCCCCn1cc(cc1-c1ccccc1C)C(=O)c1cccc2ccccc12