Reaction Details
TargetCannabinoid receptor 2
LigandBDBM50192603
Substrate/Competitorn/a
Meas. Tech.ChEMBL_422303 (CHEMBL907004)
Ki 6.4±n/a nM
Citation Huffman, JWPadgett, LWIsherwood, MLWiley, JLMartin, BR 1-Alkyl-2-aryl-4-(1-naphthoyl)pyrroles: new high affinity ligands for the cannabinoid CB1 and CB2 receptors. Bioorg Med Chem Lett16:5432-5 (2006) 
 
Cannabinoid receptor 2
Name:Cannabinoid receptor 2
Type:G Protein-Coupled Receptor (GPCR)
Mol. Mass.:39690.94
Organism:Homo sapiens (Human)
Description:P34972
Residue:360
BDBM50192603
NameBDBM50192603
Synonyms:CHEMBL385940 naphthalen-1-yl(1-pentyl-5-phenyl-1H-pyrrol-3-yl)methanone
TypeSmall organic molecule
Emp. Form.C26H25NO
Mol. Mass.367.4828
SMILESCCCCCn1cc(cc1-c1ccccc1)C(=O)c1cccc2ccccc12