Reaction Details
Target11-beta-hydroxysteroid dehydrogenase 1
LigandBDBM50192791
Substrate/Competitorn/a
Meas. Tech.ChEMBL_422284 (CHEMBL856010)
IC50 6±n/a nM
Citation Yeh, VSPatel, JRYong, HKurukulasuriya, RFung, SMonzon, KChiou, WWang, JStolarik, DImade, HBeno, DBrune, MJacobson, PSham, HLink, JT Synthesis and biological evaluation of heterocycle containing adamantane 11beta-HSD1 inhibitors. Bioorg Med Chem Lett16:5414-9 (2006) 
 
11-beta-hydroxysteroid dehydrogenase 1
Name:11-beta-hydroxysteroid dehydrogenase 1
Type:Enzyme
Mol. Mass.:32409.16
Organism:Homo sapiens (Human)
Description:P28845
Residue:292
BDBM50192791
NameBDBM50192791
Synonyms:2-(5-bromo-pyridin-2-yloxy)-N-((1R,2S,5R,7S)-5-carbamoylmethyl-adamantan-2-yl)-2-methyl-propionamide | CHEMBL437522
TypeSmall organic molecule
Emp. Form.C21H28BrN3O3
Mol. Mass.450.369
SMILESCC(C)(Oc1ccc(Br)cn1)C(=O)N[C@H]1C2C[C@@H]3C[C@H]1C[C@](CC(N)=O)(C3)C2