Reaction Details
TargetSodium-dependent serotonin transporter
LigandBDBM50192903
Substrate/Competitorn/a
Meas. Tech.ChEMBL_404072 (CHEMBL909738)
Ki 44±n/a nM
Citation Zheng, GHorton, DBDeaciuc, AGDwoskin, LPCrooks, PA Des-keto lobeline analogs with increased potency and selectivity at dopamine and serotonin transporters. Bioorg Med Chem Lett16:5018-21 (2006) 
 
Sodium-dependent serotonin transporter
Name:Sodium-dependent serotonin transporter
Type:Multi-pass membrane protein
Mol. Mass.:70168.43
Organism:Rattus norvegicus (rat)
Description:P31652
Residue:630
BDBM50192903
NameBDBM50192903
Synonyms:8R-hydroxylobel-9-ene | CHEMBL425617
TypeSmall organic molecule
Emp. Form.C22H27NO
Mol. Mass.321.4559
SMILESCN1[C@@H](C[C@@H](O)c2ccccc2)CCC[C@H]1\C=C\c1ccccc1