Reaction Details
TargetSodium-dependent dopamine transporter
LigandBDBM50192906
Substrate/Competitorn/a
Meas. Tech.ChEMBL_404071 (CHEMBL909737)
Ki 960±n/a nM
Citation Zheng, GHorton, DBDeaciuc, AGDwoskin, LPCrooks, PA Des-keto lobeline analogs with increased potency and selectivity at dopamine and serotonin transporters. Bioorg Med Chem Lett16:5018-21 (2006) 
 
Sodium-dependent dopamine transporter
Name:Sodium-dependent dopamine transporter
Type:Multi-pass membrane protein
Mol. Mass.:68749.45
Organism:Rattus norvegicus (rat)
Description:P23977
Residue:619
BDBM50192906
NameBDBM50192906
Synonyms:8S-hydroxylobel-9-ene | CHEMBL213613
TypeSmall organic molecule
Emp. Form.C22H27NO
Mol. Mass.321.4559
SMILESCN1[C@@H](C[C@H](O)c2ccccc2)CCC[C@H]1\C=C\c1ccccc1