Reaction Details
TargetSynaptic vesicular amine transporter
LigandBDBM50192907
Substrate/Competitorn/a
Meas. Tech.ChEMBL_404073 (CHEMBL909739)
Ki 590±n/a nM
Citation Zheng, GHorton, DBDeaciuc, AGDwoskin, LPCrooks, PA Des-keto lobeline analogs with increased potency and selectivity at dopamine and serotonin transporters. Bioorg Med Chem Lett16:5018-21 (2006) 
 
Synaptic vesicular amine transporter
Name:Synaptic vesicular amine transporter
Type:Protein
Mol. Mass.:55689.58
Organism:Rattus norvegicus (Rat)
Description:Q01827
Residue:515
BDBM50192907
NameBDBM50192907
Synonyms:10R-hydroxylobel-7-ene | CHEMBL217815
TypeSmall organic molecule
Emp. Form.C22H27NO
Mol. Mass.321.4559
SMILESCN1[C@H](C[C@@H](O)c2ccccc2)CCC[C@@H]1\C=C\c1ccccc1