Reaction Details
TargetSodium-dependent serotonin transporter
LigandBDBM22166
Substrate/Competitorn/a
Meas. Tech.ChEMBL_392659 (CHEMBL864283)
Ki 0.46±n/a nM
Citation Bois, FBaldwin, RMKula, NSBaldessarini, RJAl Tikriti, MInnis, RBTamagnan, GD Synthesis and monoamine transporter affinity of 2beta-carbomethoxy-3beta-(4'-p-substituted phenyl)-piperidine analogs of cocaine. Bioorg Med Chem Lett16:5222-5 (2006) 
 
Sodium-dependent serotonin transporter
Name:Sodium-dependent serotonin transporter
Type:Multi-pass membrane protein
Mol. Mass.:70168.43
Organism:Rattus norvegicus (rat)
Description:P31652
Residue:630
BDBM22166
NameBDBM22166
Synonyms:3-(4-iodophenyl)tropane-2-carboxylic acid methyl ester CHEMBL215376 RTI-258 [125I]RTI-55 | methyl (1R,2S,3S,5S)-3-(4-iodophenyl)-8-methyl-8-azabicyclo[3.2.1]octane-2-carboxylate
Typeradiolabeled ligand
Emp. Form.C16H20INO2
Mol. Mass.385.24
SMILES[H][C@]12CC[C@]([H])([C@H]([C@H](C1)c1ccc(I)cc1)C(=O)OC)N2C