Reaction Details
TargetVitamin K-dependent protein C
LigandBDBM50193223
Substrate/Competitorn/a
Meas. Tech.ChEMBL_381887 (CHEMBL870370)
IC50>33000±n/a nM
Citation De Nanteuil, GGloanec, PBéguin, SGiesen, PLHemker, HCMennecier, PRupin, AVerbeuren, TJ Low molecular weight activated protein C inhibitors as a potential treatment for hemophilic disorders. J Med Chem49:5047-50 (2006) 
 
Vitamin K-dependent protein C
Name:Vitamin K-dependent protein C
Type:Enzyme
Mol. Mass.:52067.73
Organism:Homo sapiens (Human)
Description:n/a
Residue:461
BDBM50193223
NameBDBM50193223
Synonyms:CHEMBL212786 | {(R)-1-[(S)-1-(4-carbamimidoyl-benzylcarbamoyl)-2,2-diphenyl-ethylcarbamoyl]-2-methyl-propylamino}-acetic acid
TypeSmall organic molecule
Emp. Form.C30H35N5O4
Mol. Mass.529.63
SMILESCC(C)[C@@H](NCC(O)=O)C(=O)N[C@@H](C(c1ccccc1)c1ccccc1)C(=O)NCc1ccc(cc1)C(N)=N