Reaction Details
TargetVitamin K-dependent protein C
LigandBDBM50193227
Substrate/Competitorn/a
Meas. Tech.ChEMBL_381887 (CHEMBL870370)
IC50 11250±n/a nM
Citation De Nanteuil, GGloanec, PBéguin, SGiesen, PLHemker, HCMennecier, PRupin, AVerbeuren, TJ Low molecular weight activated protein C inhibitors as a potential treatment for hemophilic disorders. J Med Chem49:5047-50 (2006) 
 
Vitamin K-dependent protein C
Name:Vitamin K-dependent protein C
Type:Enzyme
Mol. Mass.:52067.73
Organism:Homo sapiens (Human)
Description:n/a
Residue:461
BDBM50193227
NameBDBM50193227
Synonyms:CHEMBL214264 | {(R)-1-[2-(4-carbamimidoyl-benzylcarbamoyl)-indan-2-ylcarbamoyl]-2-phenyl-ethylamino}-acetic acid
TypeSmall organic molecule
Emp. Form.C29H31N5O4
Mol. Mass.513.5875
SMILESNC(=N)c1ccc(CNC(=O)C2(Cc3ccccc3C2)NC(=O)[C@@H](Cc2ccccc2)NCC(O)=O)cc1