Reaction Details
TargetProthrombin
LigandBDBM50193231
Substrate/Competitorn/a
Meas. Tech.ChEMBL_381888 (CHEMBL870372)
IC50>33000±n/a nM
Citation De Nanteuil, GGloanec, PBéguin, SGiesen, PLHemker, HCMennecier, PRupin, AVerbeuren, TJ Low molecular weight activated protein C inhibitors as a potential treatment for hemophilic disorders. J Med Chem49:5047-50 (2006) 
 
Prothrombin
Name:Prothrombin
Type:Protein
Mol. Mass.:70029.57
Organism:Homo sapiens (Human)
Description:P00734
Residue:622
BDBM50193231
NameBDBM50193231
Synonyms:({(S)-[2-(4-carbamimidoyl-benzylcarbamoyl)-indan-2-ylcarbamoyl]-cyclohexyl-methyl}-amino)-acetic acid | CHEMBL214309
TypeSmall organic molecule
Emp. Form.C28H35N5O4
Mol. Mass.505.6086
SMILESNC(=N)c1ccc(CNC(=O)C2(Cc3ccccc3C2)NC(=O)[C@@H](NCC(O)=O)C2CCCCC2)cc1