Reaction Details
TargetProthrombin
LigandBDBM50193235
Substrate/Competitorn/a
Meas. Tech.ChEMBL_381888 (CHEMBL870372)
IC50 300000±n/a nM
Citation De Nanteuil, GGloanec, PBéguin, SGiesen, PLHemker, HCMennecier, PRupin, AVerbeuren, TJ Low molecular weight activated protein C inhibitors as a potential treatment for hemophilic disorders. J Med Chem49:5047-50 (2006) 
 
Prothrombin
Name:Prothrombin
Type:Protein
Mol. Mass.:70029.57
Organism:Homo sapiens (Human)
Description:P00734
Residue:622
BDBM50193235
NameBDBM50193235
Synonyms:CHEMBL215870 | {(R)-1-[6-(4-carbamimidoyl-benzylcarbamoyl)-6,7-dihydro-5H-[1]pyrindin-6-ylcarbamoyl]-2-methyl-propylamino}-acetic acid
TypeSmall organic molecule
Emp. Form.C24H30N6O4
Mol. Mass.466.5328
SMILESCC(C)[C@@H](NCC(O)=O)C(=O)NC1(Cc2cccnc2C1)C(=O)NCc1ccc(cc1)C(N)=N