Reaction Details
TargetProthrombin
LigandBDBM50193236
Substrate/Competitorn/a
Meas. Tech.ChEMBL_381888 (CHEMBL870372)
IC50 100000±n/a nM
Citation De Nanteuil, GGloanec, PBéguin, SGiesen, PLHemker, HCMennecier, PRupin, AVerbeuren, TJ Low molecular weight activated protein C inhibitors as a potential treatment for hemophilic disorders. J Med Chem49:5047-50 (2006) 
 
Prothrombin
Name:Prothrombin
Type:Protein
Mol. Mass.:70029.57
Organism:Homo sapiens (Human)
Description:P00734
Residue:622
BDBM50193236
NameBDBM50193236
Synonyms:({[2-(4-Carbamimidoyl-benzylcarbamoyl)-indan-2-ylcarbamoyl]-methyl}-amino)-acetic acid | CHEMBL214356
TypeSmall organic molecule
Emp. Form.C22H25N5O4
Mol. Mass.423.465
SMILESNC(=N)c1ccc(CNC(=O)C2(Cc3ccccc3C2)NC(=O)CNCC(O)=O)cc1