Reaction Details
TargetVitamin K-dependent protein C
LigandBDBM50193225
Substrate/Competitorn/a
Meas. Tech.ChEMBL_381887 (CHEMBL870370)
IC50 12650±n/a nM
Citation De Nanteuil, GGloanec, PBéguin, SGiesen, PLHemker, HCMennecier, PRupin, AVerbeuren, TJ Low molecular weight activated protein C inhibitors as a potential treatment for hemophilic disorders. J Med Chem49:5047-50 (2006) 
 
Vitamin K-dependent protein C
Name:Vitamin K-dependent protein C
Type:Enzyme
Mol. Mass.:52067.73
Organism:Homo sapiens (Human)
Description:n/a
Residue:461
BDBM50193225
NameBDBM50193225
Synonyms:CHEMBL424882 | {(R)-1-[6-(4-carbamimidoyl-benzylcarbamoyl)-6,7-dihydro-5H-dibenzo[a,c]cyclohepten-6-ylcarbamoyl]-2-methyl-propylamino}-acetic acid
TypeSmall organic molecule
Emp. Form.C31H35N5O4
Mol. Mass.541.6407
SMILESCC(C)[C@@H](NCC(O)=O)C(=O)NC1(Cc2ccccc2-c2ccccc2C1)C(=O)NCc1ccc(cc1)C(N)=N