Reaction Details
TargetProthrombin
LigandBDBM50193241
Substrate/Competitorn/a
Meas. Tech.ChEMBL_381888 (CHEMBL870372)
IC50>33000±n/a nM
Citation De Nanteuil, GGloanec, PBéguin, SGiesen, PLHemker, HCMennecier, PRupin, AVerbeuren, TJ Low molecular weight activated protein C inhibitors as a potential treatment for hemophilic disorders. J Med Chem49:5047-50 (2006) 
 
Prothrombin
Name:Prothrombin
Type:Protein
Mol. Mass.:70029.57
Organism:Homo sapiens (Human)
Description:P00734
Residue:622
BDBM50193241
NameBDBM50193241
Synonyms:CHEMBL380157 | {(R)-1-[2-(4-carbamimidoyl-benzylcarbamoyl)-indan-2-ylcarbamoyl]-3-methyl-butylamino}-acetic acid
TypeSmall organic molecule
Emp. Form.C26H33N5O4
Mol. Mass.479.5713
SMILESCC(C)C[C@@H](NCC(O)=O)C(=O)NC1(Cc2ccccc2C1)C(=O)NCc1ccc(cc1)C(N)=N