Reaction Details
TargetVitamin K-dependent protein C
LigandBDBM50193239
Substrate/Competitorn/a
Meas. Tech.ChEMBL_381887 (CHEMBL870370)
IC50 9280±n/a nM
Citation De Nanteuil, GGloanec, PBéguin, SGiesen, PLHemker, HCMennecier, PRupin, AVerbeuren, TJ Low molecular weight activated protein C inhibitors as a potential treatment for hemophilic disorders. J Med Chem49:5047-50 (2006) 
 
Vitamin K-dependent protein C
Name:Vitamin K-dependent protein C
Type:Enzyme
Mol. Mass.:52067.73
Organism:Homo sapiens (Human)
Description:n/a
Residue:461
BDBM50193239
NameBDBM50193239
Synonyms:CHEMBL213774 | {(R)-1-[2-(4-carbamimidoyl-benzylcarbamoyl)-2,3-dihydro-1H-cyclopenta[b]naphthalen-2-ylcarbamoyl]-2-methyl-propylamino}-acetic acid
TypeSmall organic molecule
Emp. Form.C29H33N5O4
Mol. Mass.515.6034
SMILESCC(C)[C@@H](NCC(O)=O)C(=O)NC1(Cc2cc3ccccc3cc2C1)C(=O)NCc1ccc(cc1)C(N)=N