Reaction Details
Target5-hydroxytryptamine receptor 6
LigandBDBM50193464
Substrate/Competitorn/a
Meas. Tech.ChEMBL_383814 (CHEMBL854532)
Ki 1.2±n/a nM
Citation Sikazwe, DBondarev, MLDukat, MRangisetty, JBRoth, BLGlennon, RA Binding of sulfonyl-containing arylalkylamines at human 5-HT6 serotonin receptors. J Med Chem49:5217-25 (2006) 
 
5-hydroxytryptamine receptor 6
Name:5-hydroxytryptamine receptor 6
Type:G Protein-Coupled Receptor (GPCR)
Mol. Mass.:46968.43
Organism:Homo sapiens (Human)
Description:P50406
Residue:440
BDBM50193464
NameBDBM50193464
Synonyms:4-(3-benzenesulfonylphenyl)piperazine | CHEMBL212995
TypeSmall organic molecule
Emp. Form.C16H18N2O2S
Mol. Mass.302.391
SMILESO=S(=O)(c1ccccc1)c1cccc(c1)N1CCNCC1