Reaction Details
Target5-hydroxytryptamine receptor 6
LigandBDBM50193471
Substrate/Competitorn/a
Meas. Tech.ChEMBL_383814 (CHEMBL854532)
Ki 15±n/a nM
Citation Sikazwe, DBondarev, MLDukat, MRangisetty, JBRoth, BLGlennon, RA Binding of sulfonyl-containing arylalkylamines at human 5-HT6 serotonin receptors. J Med Chem49:5217-25 (2006) 
 
5-hydroxytryptamine receptor 6
Name:5-hydroxytryptamine receptor 6
Type:G Protein-Coupled Receptor (GPCR)
Mol. Mass.:46968.43
Organism:Homo sapiens (Human)
Description:P50406
Residue:440
BDBM50193471
NameBDBM50193471
Synonyms:CHEMBL378892 N,N-dimethyl-2-[1-(benzenesulfonyl)-1H-pyrrol-3-yl]-1-aminoethane
TypeSmall organic molecule
Emp. Form.C14H18N2O2S
Mol. Mass.278.37
SMILESCN(C)CCc1ccn(c1)S(=O)(=O)c1ccccc1