Reaction Details
TargetCathepsin B
LigandBDBM50193495
Substrate/Competitorn/a
Meas. Tech.ChEMBL_386233 (CHEMBL870447)
Ki 340±n/a nM
Citation Korukonda, RGuan, NDalton, JTLiu, JDonkor, IO Synthesis, calpain inhibitory activity, and cytotoxicity of P2-substituted proline and thiaproline peptidyl aldehydes and peptidyl alpha-ketoamides. J Med Chem49:5282-90 (2006) 
 
Cathepsin B
Name:Cathepsin B
Type:Enzyme
Mol. Mass.:37819.69
Organism:Homo sapiens (Human)
Description:gi_63102437
Residue:339
BDBM50193495
NameBDBM50193495
Synonyms:(S)-3-(4-fluorophenylsulfonyl)-N-((R,S)-1-oxo-3-phenylpropan-2-yl)thiazolidine-4-carboxamide | CHEMBL378691
TypeSmall organic molecule
Emp. Form.C19H19FN2O4S2
Mol. Mass.422.494
SMILESFc1ccc(cc1)S(=O)(=O)N1CSC[C@@H]1C(=O)NC(Cc1ccccc1)C=O