Reaction Details
TargetCathepsin B
LigandBDBM50193499
Substrate/Competitorn/a
Meas. Tech.ChEMBL_386233 (CHEMBL870447)
Ki 1480±n/a nM
Citation Korukonda, RGuan, NDalton, JTLiu, JDonkor, IO Synthesis, calpain inhibitory activity, and cytotoxicity of P2-substituted proline and thiaproline peptidyl aldehydes and peptidyl alpha-ketoamides. J Med Chem49:5282-90 (2006) 
 
Cathepsin B
Name:Cathepsin B
Type:Enzyme
Mol. Mass.:37819.69
Organism:Homo sapiens (Human)
Description:gi_63102437
Residue:339
BDBM50193499
NameBDBM50193499
Synonyms:(R)-1-(butylsulfonyl)-N-((R,S)-1-oxo-3-phenylpropan-2-yl)-pyrrolidine-2-carboxamide | CHEMBL212234
TypeSmall organic molecule
Emp. Form.C18H26N2O4S
Mol. Mass.366.475
SMILESCCCCS(=O)(=O)N1CCC[C@@H]1C(=O)NC(Cc1ccccc1)C=O