Reaction Details
TargetCathepsin B
LigandBDBM50193502
Substrate/Competitorn/a
Meas. Tech.ChEMBL_386233 (CHEMBL870447)
Ki 90±n/a nM
Citation Korukonda, RGuan, NDalton, JTLiu, JDonkor, IO Synthesis, calpain inhibitory activity, and cytotoxicity of P2-substituted proline and thiaproline peptidyl aldehydes and peptidyl alpha-ketoamides. J Med Chem49:5282-90 (2006) 
 
Cathepsin B
Name:Cathepsin B
Type:Enzyme
Mol. Mass.:37819.69
Organism:Homo sapiens (Human)
Description:gi_63102437
Residue:339
BDBM50193502
NameBDBM50193502
Synonyms:(S)-3-(4-bromophenylsulfonyl)-N-((R,S)-1-oxo-3-phenylpropan-2-yl)thiazolidine-4-carboxamide | CHEMBL213081
TypeSmall organic molecule
Emp. Form.C19H19BrN2O4S2
Mol. Mass.483.399
SMILESBrc1ccc(cc1)S(=O)(=O)N1CSC[C@@H]1C(=O)NC(Cc1ccccc1)C=O