Reaction Details
TargetCalpain-1 catalytic subunit
LigandBDBM50193506
Substrate/Competitorn/a
Meas. Tech.ChEMBL_386232 (CHEMBL869269)
Ki 191±n/a nM
Citation Korukonda, RGuan, NDalton, JTLiu, JDonkor, IO Synthesis, calpain inhibitory activity, and cytotoxicity of P2-substituted proline and thiaproline peptidyl aldehydes and peptidyl alpha-ketoamides. J Med Chem49:5282-90 (2006) 
 
Calpain-1 catalytic subunit
Name:Calpain-1 catalytic subunit
Type:Catalytic subunit; forms a heterodimer with a small (regulatory) subunit (CAPNS1)
Mol. Mass.:81729.82
Organism:Sus scrofa (pig)
Description:Native calpain-1 from porcine erythrocytes, purchased from Calbiochem, was used in assay.
Residue:714
BDBM50193506
NameBDBM50193506
Synonyms:(R)-1-(naphthalen-1-ylsulfonyl)-N-((R,S)-1-oxo-3-phenylpropan-2-yl)pyrrolidine-2-carboxamide | CHEMBL378573
TypeSmall organic molecule
Emp. Form.C24H24N2O4S
Mol. Mass.436.523
SMILESO=CC(Cc1ccccc1)NC(=O)[C@H]1CCCN1S(=O)(=O)c1cccc2ccccc12