Reaction Details
TargetCathepsin B
LigandBDBM50193508
Substrate/Competitorn/a
Meas. Tech.ChEMBL_386233 (CHEMBL870447)
Ki 4610±n/a nM
Citation Korukonda, RGuan, NDalton, JTLiu, JDonkor, IO Synthesis, calpain inhibitory activity, and cytotoxicity of P2-substituted proline and thiaproline peptidyl aldehydes and peptidyl alpha-ketoamides. J Med Chem49:5282-90 (2006) 
 
Cathepsin B
Name:Cathepsin B
Type:Enzyme
Mol. Mass.:37819.69
Organism:Homo sapiens (Human)
Description:gi_63102437
Residue:339
BDBM50193508
NameBDBM50193508
Synonyms:(R)-1-(2-nitrophenylsulfonyl)-N-((R,S)-1-oxo-3-phenylpropan-2-yl)pyrrolidine-2-carboxamide | CHEMBL215866
TypeSmall organic molecule
Emp. Form.C20H21N3O6S
Mol. Mass.431.462
SMILES[O-][N+](=O)c1ccccc1S(=O)(=O)N1CCC[C@@H]1C(=O)NC(Cc1ccccc1)C=O