Reaction Details
TargetReverse transcriptase/RNaseH
LigandBDBM50193524
Substrate/Competitorn/a
Meas. Tech.ChEMBL_385312 (CHEMBL869229)
IC50 700±n/a nM
Citation Deng, BLHartman, TLBuckheit, RWPannecouque, CDe Clercq, ECushman, M Replacement of the metabolically labile methyl esters in the alkenyldiarylmethane series of non-nucleoside reverse transcriptase inhibitors with isoxazolone, isoxazole, oxazolone, or cyano substituents. J Med Chem49:5316-23 (2006) 
 
Reverse transcriptase/RNaseH
Name:Reverse transcriptase/RNaseH
Type:PROTEIN
Mol. Mass.:65229.15
Organism:Human immunodeficiency virus 1
Description:ChEMBL_1473730
Residue:566
BDBM50193524
NameBDBM50193524
Synonyms:(Z)-5-[1-(4-cyanophenyl)-5-methoxycarbonylpent-1-enyl]-2-methoxy-3-methylbenzoic acid methyl ester | CHEMBL215724
TypeSmall organic molecule
Emp. Form.C23H22N2O4
Mol. Mass.390.4318
SMILESCOC(=O)CCC\C=C(\c1ccc(cc1)C#N)c1cc(C)c2onc(OC)c2c1